Skip to content

integration test spike #997

integration test spike

integration test spike #997

Triggered via pull request February 12, 2024 19:59
Status Failure
Total duration 9m 4s
Artifacts

ci.yaml

on: pull_request
Build and test  /  build-and-test
8m 48s
Build and test / build-and-test
Mend CLI Scan  /  mend-cli-scan
3m 49s
Mend CLI Scan / mend-cli-scan
Scan for open source vulnerabilities (Sonatype OSS Index)  /  sonatype-ossi-scan
2m 24s
Scan for open source vulnerabilities (Sonatype OSS Index) / sonatype-ossi-scan
Prepare device farm artifacts  /  prepare-device-farm-artifacts
Prepare device farm artifacts / prepare-device-farm-artifacts
Run tests in BitBar  /  bitbar-run
Run tests in BitBar / bitbar-run
BitBar test results  /  bitbar-results
BitBar test results / bitbar-results
Publish SNAPSHOT release  /  changelog-version
Publish SNAPSHOT release / changelog-version
publish-snapshot  /  ...  /  publish-to-nexus
publish-snapshot / publish-snapshot / publish-to-nexus
Fit to window
Zoom out
Zoom in

Annotations

6 errors and 3 warnings
Scan for open source vulnerabilities (Sonatype OSS Index) / sonatype-ossi-scan
Process completed with exit code 1.
org.forgerock.android.auth.ServerConfigTest ► testSha256Pinning: forgerock-auth/src/test/java/org/forgerock/android/auth/ServerConfigTest.java#L113
Failed test found in: forgerock-auth/build/test-results/testDebugUnitTest/TEST-org.forgerock.android.auth.ServerConfigTest.xml Error: java.lang.AssertionError
org.forgerock.android.auth.ServerConfigTest ► testBuildStepWithCustomPin: forgerock-auth/src/test/java/org/forgerock/android/auth/ServerConfigTest.java#L247
Failed test found in: forgerock-auth/build/test-results/testDebugUnitTest/TEST-org.forgerock.android.auth.ServerConfigTest.xml Error: java.lang.AssertionError
org.forgerock.android.auth.ServerConfigTest ► testMultiplePinning: forgerock-auth/src/test/java/org/forgerock/android/auth/ServerConfigTest.java#L156
Failed test found in: forgerock-auth/build/test-results/testDebugUnitTest/TEST-org.forgerock.android.auth.ServerConfigTest.xml Error: java.lang.AssertionError
Build and test / build-and-test
Failed test were found and 'fail-on-error' option is set to true
Build and test / build-and-test
Process completed with exit code 1.
Scan for open source vulnerabilities (Sonatype OSS Index) / sonatype-ossi-scan
Node.js 16 actions are deprecated. Please update the following actions to use Node.js 20: actions/checkout@v3, actions/setup-java@v3. For more information see: https://github.blog/changelog/2023-09-22-github-actions-transitioning-from-node-16-to-node-20/.
Mend CLI Scan / mend-cli-scan
Node.js 16 actions are deprecated. Please update the following actions to use Node.js 20: actions/checkout@v3, actions/setup-java@v3, actions/cache@v3, LouisBrunner/[email protected]. For more information see: https://github.blog/changelog/2023-09-22-github-actions-transitioning-from-node-16-to-node-20/.
Build and test / build-and-test
Node.js 16 actions are deprecated. Please update the following actions to use Node.js 20: actions/checkout@v3, actions/setup-java@v3. For more information see: https://github.blog/changelog/2023-09-22-github-actions-transitioning-from-node-16-to-node-20/.