ForgeRock Android SDK 4.3.1 Release Preparation #988
334 passed, 3 failed and 2 skipped
✅ forgerock-auth/build/test-results/testDebugUnitTest/TEST-org.forgerock.android.auth.AccessTokenTest.xml
2 tests were completed in 4s with 2 passed, 0 failed and 0 skipped.
Test suite | Passed | Failed | Skipped | Time |
---|---|---|---|---|
org.forgerock.android.auth.AccessTokenTest | 2✅ | 4s |
✅ forgerock-auth/build/test-results/testDebugUnitTest/TEST-org.forgerock.android.auth.AuthServiceMockTest.xml
12 tests were completed in 695ms with 12 passed, 0 failed and 0 skipped.
Test suite | Passed | Failed | Skipped | Time |
---|---|---|---|---|
org.forgerock.android.auth.AuthServiceMockTest | 12✅ | 695ms |
✅ forgerock-auth/build/test-results/testDebugUnitTest/TEST-org.forgerock.android.auth.AuthServiceTest.xml
2 tests were completed in 2ms with 2 passed, 0 failed and 0 skipped.
Test suite | Passed | Failed | Skipped | Time |
---|---|---|---|---|
org.forgerock.android.auth.AuthServiceTest | 2✅ | 2ms |
✅ forgerock-auth/build/test-results/testDebugUnitTest/TEST-org.forgerock.android.auth.BrowserLoginTest.xml
8 tests were completed in 15s with 8 passed, 0 failed and 0 skipped.
Test suite | Passed | Failed | Skipped | Time |
---|---|---|---|---|
org.forgerock.android.auth.BrowserLoginTest | 8✅ | 15s |
✅ forgerock-auth/build/test-results/testDebugUnitTest/TEST-org.forgerock.android.auth.callback.AppIntegrityCallbackTest.xml
5 tests were completed in 105ms with 5 passed, 0 failed and 0 skipped.
Test suite | Passed | Failed | Skipped | Time |
---|---|---|---|---|
org.forgerock.android.auth.callback.AppIntegrityCallbackTest | 5✅ | 105ms |
✅ forgerock-auth/build/test-results/testDebugUnitTest/TEST-org.forgerock.android.auth.callback.BooleanAttributeInputCallbackTest.xml
1 tests were completed in 25ms with 1 passed, 0 failed and 0 skipped.
Test suite | Passed | Failed | Skipped | Time |
---|---|---|---|---|
org.forgerock.android.auth.callback.BooleanAttributeInputCallbackTest | 1✅ | 25ms |
✅ forgerock-auth/build/test-results/testDebugUnitTest/TEST-org.forgerock.android.auth.callback.ChoiceCallbackTest.xml
1 tests were completed in 124ms with 1 passed, 0 failed and 0 skipped.
Test suite | Passed | Failed | Skipped | Time |
---|---|---|---|---|
org.forgerock.android.auth.callback.ChoiceCallbackTest | 1✅ | 124ms |
✅ forgerock-auth/build/test-results/testDebugUnitTest/TEST-org.forgerock.android.auth.callback.ConfirmationCallbackTest.xml
1 tests were completed in 19ms with 1 passed, 0 failed and 0 skipped.
Test suite | Passed | Failed | Skipped | Time |
---|---|---|---|---|
org.forgerock.android.auth.callback.ConfirmationCallbackTest | 1✅ | 19ms |
✅ forgerock-auth/build/test-results/testDebugUnitTest/TEST-org.forgerock.android.auth.callback.ConsentMappingCallbackTest.xml
1 tests were completed in 15ms with 1 passed, 0 failed and 0 skipped.
Test suite | Passed | Failed | Skipped | Time |
---|---|---|---|---|
org.forgerock.android.auth.callback.ConsentMappingCallbackTest | 1✅ | 15ms |
✅ forgerock-auth/build/test-results/testDebugUnitTest/TEST-org.forgerock.android.auth.callback.DeviceBindingCallbackTest.xml
10 tests were completed in 1s with 10 passed, 0 failed and 0 skipped.
Test suite | Passed | Failed | Skipped | Time |
---|---|---|---|---|
org.forgerock.android.auth.callback.DeviceBindingCallbackTest | 10✅ | 1s |
✅ forgerock-auth/build/test-results/testDebugUnitTest/TEST-org.forgerock.android.auth.callback.DeviceProfileCollectorCallbackTest.xml
3 tests were completed in 125ms with 3 passed, 0 failed and 0 skipped.
Test suite | Passed | Failed | Skipped | Time |
---|---|---|---|---|
org.forgerock.android.auth.callback.DeviceProfileCollectorCallbackTest | 3✅ | 125ms |
✅ forgerock-auth/build/test-results/testDebugUnitTest/TEST-org.forgerock.android.auth.callback.DeviceSigningVerifierCallbackTest.xml
6 tests were completed in 1s with 6 passed, 0 failed and 0 skipped.
Test suite | Passed | Failed | Skipped | Time |
---|---|---|---|---|
org.forgerock.android.auth.callback.DeviceSigningVerifierCallbackTest | 6✅ | 1s |
✅ forgerock-auth/build/test-results/testDebugUnitTest/TEST-org.forgerock.android.auth.callback.IdPCallbackTest.xml
1 tests were completed in 22ms with 1 passed, 0 failed and 0 skipped.
Test suite | Passed | Failed | Skipped | Time |
---|---|---|---|---|
org.forgerock.android.auth.callback.IdPCallbackTest | 1✅ | 22ms |
✅ forgerock-auth/build/test-results/testDebugUnitTest/TEST-org.forgerock.android.auth.callback.LocationCallbackTest.xml
1 tests were completed in 0ms with 1 passed, 0 failed and 0 skipped.
Test suite | Passed | Failed | Skipped | Time |
---|---|---|---|---|
org.forgerock.android.auth.callback.LocationCallbackTest | 1✅ | 0ms |
✅ forgerock-auth/build/test-results/testDebugUnitTest/TEST-org.forgerock.android.auth.callback.MetadataCallbackTest.xml
4 tests were completed in 97ms with 4 passed, 0 failed and 0 skipped.
Test suite | Passed | Failed | Skipped | Time |
---|---|---|---|---|
org.forgerock.android.auth.callback.MetadataCallbackTest | 4✅ | 97ms |
✅ forgerock-auth/build/test-results/testDebugUnitTest/TEST-org.forgerock.android.auth.callback.NameCallbackTest.xml
1 tests were completed in 20ms with 1 passed, 0 failed and 0 skipped.
Test suite | Passed | Failed | Skipped | Time |
---|---|---|---|---|
org.forgerock.android.auth.callback.NameCallbackTest | 1✅ | 20ms |
✅ forgerock-auth/build/test-results/testDebugUnitTest/TEST-org.forgerock.android.auth.callback.NumberAttributeInputCallbackTest.xml
3 tests were completed in 40ms with 3 passed, 0 failed and 0 skipped.
Test suite | Passed | Failed | Skipped | Time |
---|---|---|---|---|
org.forgerock.android.auth.callback.NumberAttributeInputCallbackTest | 3✅ | 40ms |
✅ forgerock-auth/build/test-results/testDebugUnitTest/TEST-org.forgerock.android.auth.callback.PasswordCallbackTest.xml
1 tests were completed in 13ms with 1 passed, 0 failed and 0 skipped.
Test suite | Passed | Failed | Skipped | Time |
---|---|---|---|---|
org.forgerock.android.auth.callback.PasswordCallbackTest | 1✅ | 13ms |
✅ forgerock-auth/build/test-results/testDebugUnitTest/TEST-org.forgerock.android.auth.callback.PollingWaitCallbackTest.xml
1 tests were completed in 15ms with 1 passed, 0 failed and 0 skipped.
Test suite | Passed | Failed | Skipped | Time |
---|---|---|---|---|
org.forgerock.android.auth.callback.PollingWaitCallbackTest | 1✅ | 15ms |
✅ forgerock-auth/build/test-results/testDebugUnitTest/TEST-org.forgerock.android.auth.callback.ReCaptchaCallbackTest.xml
2 tests were completed in 25ms with 2 passed, 0 failed and 0 skipped.
Test suite | Passed | Failed | Skipped | Time |
---|---|---|---|---|
org.forgerock.android.auth.callback.ReCaptchaCallbackTest | 2✅ | 25ms |
✅ forgerock-auth/build/test-results/testDebugUnitTest/TEST-org.forgerock.android.auth.callback.SelectIdPCallbackTest.xml
1 tests were completed in 14ms with 1 passed, 0 failed and 0 skipped.
Test suite | Passed | Failed | Skipped | Time |
---|---|---|---|---|
org.forgerock.android.auth.callback.SelectIdPCallbackTest | 1✅ | 14ms |
✅ forgerock-auth/build/test-results/testDebugUnitTest/TEST-org.forgerock.android.auth.callback.SerializableTest.xml
1 tests were completed in 16s with 1 passed, 0 failed and 0 skipped.
Test suite | Passed | Failed | Skipped | Time |
---|---|---|---|---|
org.forgerock.android.auth.callback.SerializableTest | 1✅ | 16s |
✅ forgerock-auth/build/test-results/testDebugUnitTest/TEST-org.forgerock.android.auth.callback.StringAttributeInputCallbackTest.xml
1 tests were completed in 15ms with 1 passed, 0 failed and 0 skipped.
Test suite | Passed | Failed | Skipped | Time |
---|---|---|---|---|
org.forgerock.android.auth.callback.StringAttributeInputCallbackTest | 1✅ | 15ms |
✅ forgerock-auth/build/test-results/testDebugUnitTest/TEST-org.forgerock.android.auth.callback.SuspendedTextOutputCallbackTest.xml
1 tests were completed in 14ms with 1 passed, 0 failed and 0 skipped.
Test suite | Passed | Failed | Skipped | Time |
---|---|---|---|---|
org.forgerock.android.auth.callback.SuspendedTextOutputCallbackTest | 1✅ | 14ms |
✅ forgerock-auth/build/test-results/testDebugUnitTest/TEST-org.forgerock.android.auth.callback.TextOutputCallbackTest.xml
1 tests were completed in 23ms with 1 passed, 0 failed and 0 skipped.
Test suite | Passed | Failed | Skipped | Time |
---|---|---|---|---|
org.forgerock.android.auth.callback.TextOutputCallbackTest | 1✅ | 23ms |
✅ forgerock-auth/build/test-results/testDebugUnitTest/TEST-org.forgerock.android.auth.callback.WebAuthnAuthenticationCallbackTest.xml
3 tests were completed in 521ms with 3 passed, 0 failed and 0 skipped.
Test suite | Passed | Failed | Skipped | Time |
---|---|---|---|---|
org.forgerock.android.auth.callback.WebAuthnAuthenticationCallbackTest | 3✅ | 521ms |
✅ forgerock-auth/build/test-results/testDebugUnitTest/TEST-org.forgerock.android.auth.callback.WebAuthnRegistrationCallbackTest.xml
4 tests were completed in 523ms with 4 passed, 0 failed and 0 skipped.
Test suite | Passed | Failed | Skipped | Time |
---|---|---|---|---|
org.forgerock.android.auth.callback.WebAuthnRegistrationCallbackTest | 4✅ | 523ms |
✅ forgerock-auth/build/test-results/testDebugUnitTest/TEST-org.forgerock.android.auth.ConfigHelperTest.xml
6 tests were completed in 188ms with 6 passed, 0 failed and 0 skipped.
Test suite | Passed | Failed | Skipped | Time |
---|---|---|---|---|
org.forgerock.android.auth.ConfigHelperTest | 6✅ | 188ms |
✅ forgerock-auth/build/test-results/testDebugUnitTest/TEST-org.forgerock.android.auth.DefaultSingleSignOnManagerTest.xml
2 tests were completed in 43ms with 2 passed, 0 failed and 0 skipped.
Test suite | Passed | Failed | Skipped | Time |
---|---|---|---|---|
org.forgerock.android.auth.DefaultSingleSignOnManagerTest | 2✅ | 43ms |
✅ forgerock-auth/build/test-results/testDebugUnitTest/TEST-org.forgerock.android.auth.DefaultTokenManagerTest.xml
9 tests were completed in 4s with 9 passed, 0 failed and 0 skipped.
Test suite | Passed | Failed | Skipped | Time |
---|---|---|---|---|
org.forgerock.android.auth.DefaultTokenManagerTest | 9✅ | 4s |
✅ forgerock-auth/build/test-results/testDebugUnitTest/TEST-org.forgerock.android.auth.devicebind.ApplicationPinDeviceAuthenticatorTest.xml
8 tests were completed in 4s with 8 passed, 0 failed and 0 skipped.
Test suite | Passed | Failed | Skipped | Time |
---|---|---|---|---|
org.forgerock.android.auth.devicebind.ApplicationPinDeviceAuthenticatorTest | 8✅ | 4s |
✅ forgerock-auth/build/test-results/testDebugUnitTest/TEST-org.forgerock.android.auth.devicebind.BiometricBindingHandlerTests.xml
14 tests were completed in 834ms with 14 passed, 0 failed and 0 skipped.
Test suite | Passed | Failed | Skipped | Time |
---|---|---|---|---|
org.forgerock.android.auth.devicebind.BiometricBindingHandlerTests | 14✅ | 834ms |
✅ forgerock-auth/build/test-results/testDebugUnitTest/TEST-org.forgerock.android.auth.devicebind.DeviceBindAuthenticationTests.xml
20 tests were completed in 2s with 20 passed, 0 failed and 0 skipped.
Test suite | Passed | Failed | Skipped | Time |
---|---|---|---|---|
org.forgerock.android.auth.devicebind.DeviceBindAuthenticationTests | 20✅ | 2s |
✅ forgerock-auth/build/test-results/testDebugUnitTest/TEST-org.forgerock.android.auth.devicebind.LocalDeviceBindingRepositoryTests.xml
2 tests were completed in 49ms with 2 passed, 0 failed and 0 skipped.
Test suite | Passed | Failed | Skipped | Time |
---|---|---|---|---|
org.forgerock.android.auth.devicebind.LocalDeviceBindingRepositoryTests | 2✅ | 49ms |
✅ forgerock-auth/build/test-results/testDebugUnitTest/TEST-org.forgerock.android.auth.devicebind.RSASASignatureSignerTests.xml
2 tests were completed in 332ms with 2 passed, 0 failed and 0 skipped.
Test suite | Passed | Failed | Skipped | Time |
---|---|---|---|---|
org.forgerock.android.auth.devicebind.RSASASignatureSignerTests | 2✅ | 332ms |
✅ forgerock-auth/build/test-results/testDebugUnitTest/TEST-org.forgerock.android.auth.devicebind.UserDeviceKeyServiceTest.xml
10 tests were completed in 393ms with 10 passed, 0 failed and 0 skipped.
Test suite | Passed | Failed | Skipped | Time |
---|---|---|---|---|
org.forgerock.android.auth.devicebind.UserDeviceKeyServiceTest | 10✅ | 393ms |
✅ forgerock-auth/build/test-results/testDebugUnitTest/TEST-org.forgerock.android.auth.DeviceBindingRepositoryTest.xml
2 tests were completed in 225ms with 2 passed, 0 failed and 0 skipped.
Test suite | Passed | Failed | Skipped | Time |
---|---|---|---|---|
org.forgerock.android.auth.DeviceBindingRepositoryTest | 2✅ | 225ms |
✅ forgerock-auth/build/test-results/testDebugUnitTest/TEST-org.forgerock.android.auth.ExtensionTest.xml
3 tests were completed in 1ms with 3 passed, 0 failed and 0 skipped.
Test suite | Passed | Failed | Skipped | Time |
---|---|---|---|---|
org.forgerock.android.auth.ExtensionTest | 3✅ | 1ms |
✅ forgerock-auth/build/test-results/testDebugUnitTest/TEST-org.forgerock.android.auth.FRAuthMockTest.xml
5 tests were completed in 522ms with 5 passed, 0 failed and 0 skipped.
Test suite | Passed | Failed | Skipped | Time |
---|---|---|---|---|
org.forgerock.android.auth.FRAuthMockTest | 5✅ | 522ms |
✅ forgerock-auth/build/test-results/testDebugUnitTest/TEST-org.forgerock.android.auth.FRAuthRegistrationMockTest.xml
5 tests were completed in 417ms with 5 passed, 0 failed and 0 skipped.
Test suite | Passed | Failed | Skipped | Time |
---|---|---|---|---|
org.forgerock.android.auth.FRAuthRegistrationMockTest | 5✅ | 417ms |
✅ forgerock-auth/build/test-results/testDebugUnitTest/TEST-org.forgerock.android.auth.FRDeviceTest.xml
7 tests were completed in 448ms with 7 passed, 0 failed and 0 skipped.
Test suite | Passed | Failed | Skipped | Time |
---|---|---|---|---|
org.forgerock.android.auth.FRDeviceTest | 7✅ | 448ms |
✅ forgerock-auth/build/test-results/testDebugUnitTest/TEST-org.forgerock.android.auth.FRLifeCycleListenerTest.xml
2 tests were completed in 5s with 2 passed, 0 failed and 0 skipped.
Test suite | Passed | Failed | Skipped | Time |
---|---|---|---|---|
org.forgerock.android.auth.FRLifeCycleListenerTest | 2✅ | 5s |
✅ forgerock-auth/build/test-results/testDebugUnitTest/TEST-org.forgerock.android.auth.FROptionTest.xml
5 tests were completed in 8ms with 5 passed, 0 failed and 0 skipped.
Test suite | Passed | Failed | Skipped | Time |
---|---|---|---|---|
org.forgerock.android.auth.FROptionTest | 5✅ | 8ms |
✅ forgerock-auth/build/test-results/testDebugUnitTest/TEST-org.forgerock.android.auth.FRSessionMockTest.xml
10 tests were completed in 26s with 10 passed, 0 failed and 0 skipped.
Test suite | Passed | Failed | Skipped | Time |
---|---|---|---|---|
org.forgerock.android.auth.FRSessionMockTest | 10✅ | 26s |
✅ forgerock-auth/build/test-results/testDebugUnitTest/TEST-org.forgerock.android.auth.FRUserMockTest.xml
29 tests were completed in 5s with 27 passed, 0 failed and 2 skipped.
Test suite | Passed | Failed | Skipped | Time |
---|---|---|---|---|
org.forgerock.android.auth.FRUserMockTest | 27✅ | 2⚪ | 5s |
✅ forgerock-auth/build/test-results/testDebugUnitTest/TEST-org.forgerock.android.auth.OAuth2MockTest.xml
5 tests were completed in 133ms with 5 passed, 0 failed and 0 skipped.
Test suite | Passed | Failed | Skipped | Time |
---|---|---|---|---|
org.forgerock.android.auth.OAuth2MockTest | 5✅ | 133ms |
✅ forgerock-auth/build/test-results/testDebugUnitTest/TEST-org.forgerock.android.auth.PersistentCookieTest.xml
8 tests were completed in 258ms with 8 passed, 0 failed and 0 skipped.
Test suite | Passed | Failed | Skipped | Time |
---|---|---|---|---|
org.forgerock.android.auth.PersistentCookieTest | 8✅ | 258ms |
✅ forgerock-auth/build/test-results/testDebugUnitTest/TEST-org.forgerock.android.auth.PolicyAdviceTest.xml
7 tests were completed in 621ms with 7 passed, 0 failed and 0 skipped.
Test suite | Passed | Failed | Skipped | Time |
---|---|---|---|---|
org.forgerock.android.auth.PolicyAdviceTest | 7✅ | 621ms |
❌ forgerock-auth/build/test-results/testDebugUnitTest/TEST-org.forgerock.android.auth.ServerConfigTest.xml
10 tests were completed in 338ms with 7 passed, 3 failed and 0 skipped.
Test suite | Passed | Failed | Skipped | Time |
---|---|---|---|---|
org.forgerock.android.auth.ServerConfigTest | 7✅ | 3❌ | 338ms |
❌ org.forgerock.android.auth.ServerConfigTest
❌ testSha256Pinning
java.lang.AssertionError
✅ testPinningConfig
✅ testOkHttpCachedWithDifferentIdentifier
❌ testBuildStepWithCustomPin
java.lang.AssertionError
❌ testMultiplePinning
java.lang.AssertionError
✅ testMissingContext
✅ testBuildStepWithCustomPinFailed
✅ testCachedOkHttpClient
✅ testInvalidPin
✅ testCustomPath
✅ forgerock-auth/build/test-results/testDebugUnitTest/TEST-org.forgerock.android.auth.SocialLoginTest.xml
6 tests were completed in 2s with 6 passed, 0 failed and 0 skipped.
Test suite | Passed | Failed | Skipped | Time |
---|---|---|---|---|
org.forgerock.android.auth.SocialLoginTest | 6✅ | 2s |
✅ forgerock-auth/build/test-results/testDebugUnitTest/TEST-org.forgerock.android.auth.SSOBroadcastModelTest.xml
4 tests were completed in 2s with 4 passed, 0 failed and 0 skipped.
Test suite | Passed | Failed | Skipped | Time |
---|---|---|---|---|
org.forgerock.android.auth.SSOBroadcastModelTest | 4✅ | 2s |
✅ forgerock-auth/build/test-results/testDebugUnitTest/TEST-org.forgerock.android.auth.SSOBroadcastReceiverIntegrationTests.xml
1 tests were completed in 303ms with 1 passed, 0 failed and 0 skipped.
Test suite | Passed | Failed | Skipped | Time |
---|---|---|---|---|
org.forgerock.android.auth.SSOBroadcastReceiverIntegrationTests | 1✅ | 303ms |
✅ forgerock-auth/build/test-results/testDebugUnitTest/TEST-org.forgerock.android.auth.SSOBroadcastReceiverTest.xml
2 tests were completed in 116ms with 2 passed, 0 failed and 0 skipped.
Test suite | Passed | Failed | Skipped | Time |
---|---|---|---|---|
org.forgerock.android.auth.SSOBroadcastReceiverTest | 2✅ | 116ms |
✅ forgerock-auth/build/test-results/testDebugUnitTest/TEST-org.forgerock.android.auth.webauthn.FRWebAuthnTest.xml
3 tests were completed in 81ms with 3 passed, 0 failed and 0 skipped.
Test suite | Passed | Failed | Skipped | Time |
---|---|---|---|---|
org.forgerock.android.auth.webauthn.FRWebAuthnTest | 3✅ | 81ms |
✅ forgerock-auth/build/test-results/testDebugUnitTest/TEST-org.forgerock.android.auth.webauthn.WebAuthnAuthenticationTest.xml
3 tests were completed in 233ms with 3 passed, 0 failed and 0 skipped.
Test suite | Passed | Failed | Skipped | Time |
---|---|---|---|---|
org.forgerock.android.auth.webauthn.WebAuthnAuthenticationTest | 3✅ | 233ms |
✅ forgerock-auth/build/test-results/testDebugUnitTest/TEST-org.forgerock.android.auth.webauthn.WebAuthnRegistrationTest.xml
2 tests were completed in 124ms with 2 passed, 0 failed and 0 skipped.
Test suite | Passed | Failed | Skipped | Time |
---|---|---|---|---|
org.forgerock.android.auth.webauthn.WebAuthnRegistrationTest | 2✅ | 124ms |
✅ forgerock-auth/build/test-results/testDebugUnitTest/TEST-org.forgerock.android.auth.WebAuthnDataRepositoryTest.xml
7 tests were completed in 187ms with 7 passed, 0 failed and 0 skipped.
Test suite | Passed | Failed | Skipped | Time |
---|---|---|---|---|
org.forgerock.android.auth.WebAuthnDataRepositoryTest | 7✅ | 187ms |
✅ forgerock-core/build/test-results/testDebugUnitTest/TEST-org.forgerock.android.auth.AppPinAuthenticatorTest.xml
6 tests were completed in 19s with 6 passed, 0 failed and 0 skipped.
Test suite | Passed | Failed | Skipped | Time |
---|---|---|---|---|
org.forgerock.android.auth.AppPinAuthenticatorTest | 6✅ | 19s |
✅ forgerock-core/build/test-results/testDebugUnitTest/TEST-org.forgerock.android.auth.InterceptorProviderTest.xml
6 tests were completed in 1s with 6 passed, 0 failed and 0 skipped.
Test suite | Passed | Failed | Skipped | Time |
---|---|---|---|---|
org.forgerock.android.auth.InterceptorProviderTest | 6✅ | 1s |
✅ forgerock-core/build/test-results/testDebugUnitTest/TEST-org.forgerock.android.auth.KeyStoreManagerTest.xml
2 tests were completed in 676ms with 2 passed, 0 failed and 0 skipped.
Test suite | Passed | Failed | Skipped | Time |
---|---|---|---|---|
org.forgerock.android.auth.KeyStoreManagerTest | 2✅ | 676ms |
✅ forgerock-core/build/test-results/testDebugUnitTest/TEST-org.forgerock.android.auth.LoggerTest.xml
12 tests were completed in 606ms with 12 passed, 0 failed and 0 skipped.
Test suite | Passed | Failed | Skipped | Time |
---|---|---|---|---|
org.forgerock.android.auth.LoggerTest | 12✅ | 606ms |
✅ forgerock-core/build/test-results/testDebugUnitTest/TEST-org.forgerock.android.auth.LoggerUnitTest.xml
3 tests were completed in 118ms with 3 passed, 0 failed and 0 skipped.
Test suite | Passed | Failed | Skipped | Time |
---|---|---|---|---|
org.forgerock.android.auth.LoggerUnitTest | 3✅ | 118ms |
✅ forgerock-core/build/test-results/testDebugUnitTest/TEST-org.forgerock.android.auth.NetworkConfigTest.xml
3 tests were completed in 1s with 3 passed, 0 failed and 0 skipped.
Test suite | Passed | Failed | Skipped | Time |
---|---|---|---|---|
org.forgerock.android.auth.NetworkConfigTest | 3✅ | 1s |
✅ forgerock-core/build/test-results/testDebugUnitTest/TEST-org.forgerock.android.auth.RequestInterceptorTest.xml
18 tests were completed in 2s with 18 passed, 0 failed and 0 skipped.
Test suite | Passed | Failed | Skipped | Time |
---|---|---|---|---|
org.forgerock.android.auth.RequestInterceptorTest | 18✅ | 2s |
✅ forgerock-core/build/test-results/testDebugUnitTest/TEST-org.forgerock.android.auth.RootDetectorTest.xml
12 tests were completed in 536ms with 12 passed, 0 failed and 0 skipped.
Test suite | Passed | Failed | Skipped | Time |
---|---|---|---|---|
org.forgerock.android.auth.RootDetectorTest | 12✅ | 536ms |
Annotations
github-actions / Unit tests results
org.forgerock.android.auth.ServerConfigTest ► testSha256Pinning
Failed test found in:
forgerock-auth/build/test-results/testDebugUnitTest/TEST-org.forgerock.android.auth.ServerConfigTest.xml
Error:
java.lang.AssertionError
Raw output
java.lang.AssertionError
at org.junit.Assert.fail(Assert.java:87)
at org.junit.Assert.assertTrue(Assert.java:42)
at org.junit.Assert.assertTrue(Assert.java:53)
at org.forgerock.android.auth.ServerConfigTest.testSha256Pinning(ServerConfigTest.java:113)
at java.base/jdk.internal.reflect.NativeMethodAccessorImpl.invoke0(Native Method)
at java.base/jdk.internal.reflect.NativeMethodAccessorImpl.invoke(NativeMethodAccessorImpl.java:77)
at java.base/jdk.internal.reflect.DelegatingMethodAccessorImpl.invoke(DelegatingMethodAccessorImpl.java:43)
at java.base/java.lang.reflect.Method.invoke(Method.java:568)
at org.junit.runners.model.FrameworkMethod$1.runReflectiveCall(FrameworkMethod.java:59)
at org.junit.internal.runners.model.ReflectiveCallable.run(ReflectiveCallable.java:12)
at org.junit.runners.model.FrameworkMethod.invokeExplosively(FrameworkMethod.java:56)
at org.junit.internal.runners.statements.InvokeMethod.evaluate(InvokeMethod.java:17)
at org.junit.internal.runners.statements.RunBefores.evaluate(RunBefores.java:26)
at org.junit.runners.ParentRunner$3.evaluate(ParentRunner.java:306)
at org.robolectric.RobolectricTestRunner$HelperTestRunner$1.evaluate(RobolectricTestRunner.java:580)
at org.robolectric.internal.SandboxTestRunner$2.lambda$evaluate$2(SandboxTestRunner.java:287)
at org.robolectric.internal.bytecode.Sandbox.lambda$runOnMainThread$0(Sandbox.java:99)
at java.base/java.util.concurrent.FutureTask.run(FutureTask.java:264)
at java.base/java.util.concurrent.ThreadPoolExecutor.runWorker(ThreadPoolExecutor.java:1136)
at java.base/java.util.concurrent.ThreadPoolExecutor$Worker.run(ThreadPoolExecutor.java:635)
at java.base/java.lang.Thread.run(Thread.java:840)
github-actions / Unit tests results
org.forgerock.android.auth.ServerConfigTest ► testBuildStepWithCustomPin
Failed test found in:
forgerock-auth/build/test-results/testDebugUnitTest/TEST-org.forgerock.android.auth.ServerConfigTest.xml
Error:
java.lang.AssertionError
Raw output
java.lang.AssertionError
at org.junit.Assert.fail(Assert.java:87)
at org.junit.Assert.assertTrue(Assert.java:42)
at org.junit.Assert.assertTrue(Assert.java:53)
at org.forgerock.android.auth.ServerConfigTest.testBuildStepWithCustomPin(ServerConfigTest.java:247)
at java.base/jdk.internal.reflect.NativeMethodAccessorImpl.invoke0(Native Method)
at java.base/jdk.internal.reflect.NativeMethodAccessorImpl.invoke(NativeMethodAccessorImpl.java:77)
at java.base/jdk.internal.reflect.DelegatingMethodAccessorImpl.invoke(DelegatingMethodAccessorImpl.java:43)
at java.base/java.lang.reflect.Method.invoke(Method.java:568)
at org.junit.runners.model.FrameworkMethod$1.runReflectiveCall(FrameworkMethod.java:59)
at org.junit.internal.runners.model.ReflectiveCallable.run(ReflectiveCallable.java:12)
at org.junit.runners.model.FrameworkMethod.invokeExplosively(FrameworkMethod.java:56)
at org.junit.internal.runners.statements.InvokeMethod.evaluate(InvokeMethod.java:17)
at org.junit.internal.runners.statements.RunBefores.evaluate(RunBefores.java:26)
at org.junit.runners.ParentRunner$3.evaluate(ParentRunner.java:306)
at org.robolectric.RobolectricTestRunner$HelperTestRunner$1.evaluate(RobolectricTestRunner.java:580)
at org.robolectric.internal.SandboxTestRunner$2.lambda$evaluate$2(SandboxTestRunner.java:287)
at org.robolectric.internal.bytecode.Sandbox.lambda$runOnMainThread$0(Sandbox.java:99)
at java.base/java.util.concurrent.FutureTask.run(FutureTask.java:264)
at java.base/java.util.concurrent.ThreadPoolExecutor.runWorker(ThreadPoolExecutor.java:1136)
at java.base/java.util.concurrent.ThreadPoolExecutor$Worker.run(ThreadPoolExecutor.java:635)
at java.base/java.lang.Thread.run(Thread.java:840)
github-actions / Unit tests results
org.forgerock.android.auth.ServerConfigTest ► testMultiplePinning
Failed test found in:
forgerock-auth/build/test-results/testDebugUnitTest/TEST-org.forgerock.android.auth.ServerConfigTest.xml
Error:
java.lang.AssertionError
Raw output
java.lang.AssertionError
at org.junit.Assert.fail(Assert.java:87)
at org.junit.Assert.assertTrue(Assert.java:42)
at org.junit.Assert.assertTrue(Assert.java:53)
at org.forgerock.android.auth.ServerConfigTest.testMultiplePinning(ServerConfigTest.java:156)
at java.base/jdk.internal.reflect.NativeMethodAccessorImpl.invoke0(Native Method)
at java.base/jdk.internal.reflect.NativeMethodAccessorImpl.invoke(NativeMethodAccessorImpl.java:77)
at java.base/jdk.internal.reflect.DelegatingMethodAccessorImpl.invoke(DelegatingMethodAccessorImpl.java:43)
at java.base/java.lang.reflect.Method.invoke(Method.java:568)
at org.junit.runners.model.FrameworkMethod$1.runReflectiveCall(FrameworkMethod.java:59)
at org.junit.internal.runners.model.ReflectiveCallable.run(ReflectiveCallable.java:12)
at org.junit.runners.model.FrameworkMethod.invokeExplosively(FrameworkMethod.java:56)
at org.junit.internal.runners.statements.InvokeMethod.evaluate(InvokeMethod.java:17)
at org.junit.internal.runners.statements.RunBefores.evaluate(RunBefores.java:26)
at org.junit.runners.ParentRunner$3.evaluate(ParentRunner.java:306)
at org.robolectric.RobolectricTestRunner$HelperTestRunner$1.evaluate(RobolectricTestRunner.java:580)
at org.robolectric.internal.SandboxTestRunner$2.lambda$evaluate$2(SandboxTestRunner.java:287)
at org.robolectric.internal.bytecode.Sandbox.lambda$runOnMainThread$0(Sandbox.java:99)
at java.base/java.util.concurrent.FutureTask.run(FutureTask.java:264)
at java.base/java.util.concurrent.ThreadPoolExecutor.runWorker(ThreadPoolExecutor.java:1136)
at java.base/java.util.concurrent.ThreadPoolExecutor$Worker.run(ThreadPoolExecutor.java:635)
at java.base/java.lang.Thread.run(Thread.java:840)