SDKS-2988 Resolve the CVE-2023-52428 issue by upgrading the nimbus-jose-jwt #1011
634 passed, 2 failed and 2 skipped
✅ forgerock-auth/build/test-results/testDebugUnitTest/TEST-org.forgerock.android.auth.AccessTokenTest.xml
2 tests were completed in 3s with 2 passed, 0 failed and 0 skipped.
Test suite | Passed | Failed | Skipped | Time |
---|---|---|---|---|
org.forgerock.android.auth.AccessTokenTest | 2✅ | 3s |
✅ forgerock-auth/build/test-results/testDebugUnitTest/TEST-org.forgerock.android.auth.AuthServiceMockTest.xml
12 tests were completed in 573ms with 12 passed, 0 failed and 0 skipped.
Test suite | Passed | Failed | Skipped | Time |
---|---|---|---|---|
org.forgerock.android.auth.AuthServiceMockTest | 12✅ | 573ms |
✅ forgerock-auth/build/test-results/testDebugUnitTest/TEST-org.forgerock.android.auth.AuthServiceTest.xml
2 tests were completed in 2ms with 2 passed, 0 failed and 0 skipped.
Test suite | Passed | Failed | Skipped | Time |
---|---|---|---|---|
org.forgerock.android.auth.AuthServiceTest | 2✅ | 2ms |
✅ forgerock-auth/build/test-results/testDebugUnitTest/TEST-org.forgerock.android.auth.BrowserLoginTest.xml
8 tests were completed in 15s with 8 passed, 0 failed and 0 skipped.
Test suite | Passed | Failed | Skipped | Time |
---|---|---|---|---|
org.forgerock.android.auth.BrowserLoginTest | 8✅ | 15s |
✅ forgerock-auth/build/test-results/testDebugUnitTest/TEST-org.forgerock.android.auth.callback.AppIntegrityCallbackTest.xml
5 tests were completed in 175ms with 5 passed, 0 failed and 0 skipped.
Test suite | Passed | Failed | Skipped | Time |
---|---|---|---|---|
org.forgerock.android.auth.callback.AppIntegrityCallbackTest | 5✅ | 175ms |
✅ forgerock-auth/build/test-results/testDebugUnitTest/TEST-org.forgerock.android.auth.callback.BooleanAttributeInputCallbackTest.xml
1 tests were completed in 26ms with 1 passed, 0 failed and 0 skipped.
Test suite | Passed | Failed | Skipped | Time |
---|---|---|---|---|
org.forgerock.android.auth.callback.BooleanAttributeInputCallbackTest | 1✅ | 26ms |
✅ forgerock-auth/build/test-results/testDebugUnitTest/TEST-org.forgerock.android.auth.callback.ChoiceCallbackTest.xml
1 tests were completed in 19ms with 1 passed, 0 failed and 0 skipped.
Test suite | Passed | Failed | Skipped | Time |
---|---|---|---|---|
org.forgerock.android.auth.callback.ChoiceCallbackTest | 1✅ | 19ms |
✅ forgerock-auth/build/test-results/testDebugUnitTest/TEST-org.forgerock.android.auth.callback.ConfirmationCallbackTest.xml
1 tests were completed in 24ms with 1 passed, 0 failed and 0 skipped.
Test suite | Passed | Failed | Skipped | Time |
---|---|---|---|---|
org.forgerock.android.auth.callback.ConfirmationCallbackTest | 1✅ | 24ms |
✅ forgerock-auth/build/test-results/testDebugUnitTest/TEST-org.forgerock.android.auth.callback.ConsentMappingCallbackTest.xml
1 tests were completed in 19ms with 1 passed, 0 failed and 0 skipped.
Test suite | Passed | Failed | Skipped | Time |
---|---|---|---|---|
org.forgerock.android.auth.callback.ConsentMappingCallbackTest | 1✅ | 19ms |
✅ forgerock-auth/build/test-results/testDebugUnitTest/TEST-org.forgerock.android.auth.callback.DeviceBindingCallbackTest.xml
10 tests were completed in 1s with 10 passed, 0 failed and 0 skipped.
Test suite | Passed | Failed | Skipped | Time |
---|---|---|---|---|
org.forgerock.android.auth.callback.DeviceBindingCallbackTest | 10✅ | 1s |
✅ forgerock-auth/build/test-results/testDebugUnitTest/TEST-org.forgerock.android.auth.callback.DeviceProfileCollectorCallbackTest.xml
3 tests were completed in 149ms with 3 passed, 0 failed and 0 skipped.
Test suite | Passed | Failed | Skipped | Time |
---|---|---|---|---|
org.forgerock.android.auth.callback.DeviceProfileCollectorCallbackTest | 3✅ | 149ms |
✅ forgerock-auth/build/test-results/testDebugUnitTest/TEST-org.forgerock.android.auth.callback.DeviceSigningVerifierCallbackTest.xml
6 tests were completed in 1s with 6 passed, 0 failed and 0 skipped.
Test suite | Passed | Failed | Skipped | Time |
---|---|---|---|---|
org.forgerock.android.auth.callback.DeviceSigningVerifierCallbackTest | 6✅ | 1s |
✅ forgerock-auth/build/test-results/testDebugUnitTest/TEST-org.forgerock.android.auth.callback.IdPCallbackTest.xml
1 tests were completed in 18ms with 1 passed, 0 failed and 0 skipped.
Test suite | Passed | Failed | Skipped | Time |
---|---|---|---|---|
org.forgerock.android.auth.callback.IdPCallbackTest | 1✅ | 18ms |
✅ forgerock-auth/build/test-results/testDebugUnitTest/TEST-org.forgerock.android.auth.callback.LocationCallbackTest.xml
1 tests were completed in 0ms with 1 passed, 0 failed and 0 skipped.
Test suite | Passed | Failed | Skipped | Time |
---|---|---|---|---|
org.forgerock.android.auth.callback.LocationCallbackTest | 1✅ | 0ms |
✅ forgerock-auth/build/test-results/testDebugUnitTest/TEST-org.forgerock.android.auth.callback.MetadataCallbackTest.xml
4 tests were completed in 99ms with 4 passed, 0 failed and 0 skipped.
Test suite | Passed | Failed | Skipped | Time |
---|---|---|---|---|
org.forgerock.android.auth.callback.MetadataCallbackTest | 4✅ | 99ms |
✅ forgerock-auth/build/test-results/testDebugUnitTest/TEST-org.forgerock.android.auth.callback.NameCallbackTest.xml
1 tests were completed in 16ms with 1 passed, 0 failed and 0 skipped.
Test suite | Passed | Failed | Skipped | Time |
---|---|---|---|---|
org.forgerock.android.auth.callback.NameCallbackTest | 1✅ | 16ms |
✅ forgerock-auth/build/test-results/testDebugUnitTest/TEST-org.forgerock.android.auth.callback.NumberAttributeInputCallbackTest.xml
3 tests were completed in 54ms with 3 passed, 0 failed and 0 skipped.
Test suite | Passed | Failed | Skipped | Time |
---|---|---|---|---|
org.forgerock.android.auth.callback.NumberAttributeInputCallbackTest | 3✅ | 54ms |
✅ forgerock-auth/build/test-results/testDebugUnitTest/TEST-org.forgerock.android.auth.callback.PasswordCallbackTest.xml
1 tests were completed in 19ms with 1 passed, 0 failed and 0 skipped.
Test suite | Passed | Failed | Skipped | Time |
---|---|---|---|---|
org.forgerock.android.auth.callback.PasswordCallbackTest | 1✅ | 19ms |
✅ forgerock-auth/build/test-results/testDebugUnitTest/TEST-org.forgerock.android.auth.callback.PollingWaitCallbackTest.xml
1 tests were completed in 16ms with 1 passed, 0 failed and 0 skipped.
Test suite | Passed | Failed | Skipped | Time |
---|---|---|---|---|
org.forgerock.android.auth.callback.PollingWaitCallbackTest | 1✅ | 16ms |
✅ forgerock-auth/build/test-results/testDebugUnitTest/TEST-org.forgerock.android.auth.callback.ReCaptchaCallbackTest.xml
2 tests were completed in 40ms with 2 passed, 0 failed and 0 skipped.
Test suite | Passed | Failed | Skipped | Time |
---|---|---|---|---|
org.forgerock.android.auth.callback.ReCaptchaCallbackTest | 2✅ | 40ms |
✅ forgerock-auth/build/test-results/testDebugUnitTest/TEST-org.forgerock.android.auth.callback.SelectIdPCallbackTest.xml
1 tests were completed in 18ms with 1 passed, 0 failed and 0 skipped.
Test suite | Passed | Failed | Skipped | Time |
---|---|---|---|---|
org.forgerock.android.auth.callback.SelectIdPCallbackTest | 1✅ | 18ms |
✅ forgerock-auth/build/test-results/testDebugUnitTest/TEST-org.forgerock.android.auth.callback.SerializableTest.xml
1 tests were completed in 15s with 1 passed, 0 failed and 0 skipped.
Test suite | Passed | Failed | Skipped | Time |
---|---|---|---|---|
org.forgerock.android.auth.callback.SerializableTest | 1✅ | 15s |
✅ forgerock-auth/build/test-results/testDebugUnitTest/TEST-org.forgerock.android.auth.callback.StringAttributeInputCallbackTest.xml
1 tests were completed in 21ms with 1 passed, 0 failed and 0 skipped.
Test suite | Passed | Failed | Skipped | Time |
---|---|---|---|---|
org.forgerock.android.auth.callback.StringAttributeInputCallbackTest | 1✅ | 21ms |
✅ forgerock-auth/build/test-results/testDebugUnitTest/TEST-org.forgerock.android.auth.callback.SuspendedTextOutputCallbackTest.xml
1 tests were completed in 14ms with 1 passed, 0 failed and 0 skipped.
Test suite | Passed | Failed | Skipped | Time |
---|---|---|---|---|
org.forgerock.android.auth.callback.SuspendedTextOutputCallbackTest | 1✅ | 14ms |
✅ forgerock-auth/build/test-results/testDebugUnitTest/TEST-org.forgerock.android.auth.callback.TextInputCallbackTest.xml
1 tests were completed in 16ms with 1 passed, 0 failed and 0 skipped.
Test suite | Passed | Failed | Skipped | Time |
---|---|---|---|---|
org.forgerock.android.auth.callback.TextInputCallbackTest | 1✅ | 16ms |
✅ forgerock-auth/build/test-results/testDebugUnitTest/TEST-org.forgerock.android.auth.callback.TextOutputCallbackTest.xml
1 tests were completed in 17ms with 1 passed, 0 failed and 0 skipped.
Test suite | Passed | Failed | Skipped | Time |
---|---|---|---|---|
org.forgerock.android.auth.callback.TextOutputCallbackTest | 1✅ | 17ms |
✅ forgerock-auth/build/test-results/testDebugUnitTest/TEST-org.forgerock.android.auth.callback.WebAuthnAuthenticationCallbackTest.xml
3 tests were completed in 248ms with 3 passed, 0 failed and 0 skipped.
Test suite | Passed | Failed | Skipped | Time |
---|---|---|---|---|
org.forgerock.android.auth.callback.WebAuthnAuthenticationCallbackTest | 3✅ | 248ms |
✅ forgerock-auth/build/test-results/testDebugUnitTest/TEST-org.forgerock.android.auth.callback.WebAuthnRegistrationCallbackTest.xml
4 tests were completed in 206ms with 4 passed, 0 failed and 0 skipped.
Test suite | Passed | Failed | Skipped | Time |
---|---|---|---|---|
org.forgerock.android.auth.callback.WebAuthnRegistrationCallbackTest | 4✅ | 206ms |
✅ forgerock-auth/build/test-results/testDebugUnitTest/TEST-org.forgerock.android.auth.ConfigHelperTest.xml
6 tests were completed in 337ms with 6 passed, 0 failed and 0 skipped.
Test suite | Passed | Failed | Skipped | Time |
---|---|---|---|---|
org.forgerock.android.auth.ConfigHelperTest | 6✅ | 337ms |
✅ forgerock-auth/build/test-results/testDebugUnitTest/TEST-org.forgerock.android.auth.DefaultSingleSignOnManagerTest.xml
2 tests were completed in 65ms with 2 passed, 0 failed and 0 skipped.
Test suite | Passed | Failed | Skipped | Time |
---|---|---|---|---|
org.forgerock.android.auth.DefaultSingleSignOnManagerTest | 2✅ | 65ms |
✅ forgerock-auth/build/test-results/testDebugUnitTest/TEST-org.forgerock.android.auth.DefaultTokenManagerTest.xml
9 tests were completed in 4s with 9 passed, 0 failed and 0 skipped.
Test suite | Passed | Failed | Skipped | Time |
---|---|---|---|---|
org.forgerock.android.auth.DefaultTokenManagerTest | 9✅ | 4s |
✅ forgerock-auth/build/test-results/testDebugUnitTest/TEST-org.forgerock.android.auth.devicebind.ApplicationPinDeviceAuthenticatorTest.xml
8 tests were completed in 4s with 8 passed, 0 failed and 0 skipped.
Test suite | Passed | Failed | Skipped | Time |
---|---|---|---|---|
org.forgerock.android.auth.devicebind.ApplicationPinDeviceAuthenticatorTest | 8✅ | 4s |
✅ forgerock-auth/build/test-results/testDebugUnitTest/TEST-org.forgerock.android.auth.devicebind.BiometricBindingHandlerTests.xml
14 tests were completed in 528ms with 14 passed, 0 failed and 0 skipped.
Test suite | Passed | Failed | Skipped | Time |
---|---|---|---|---|
org.forgerock.android.auth.devicebind.BiometricBindingHandlerTests | 14✅ | 528ms |
✅ forgerock-auth/build/test-results/testDebugUnitTest/TEST-org.forgerock.android.auth.devicebind.DeviceBindAuthenticationTests.xml
20 tests were completed in 991ms with 20 passed, 0 failed and 0 skipped.
Test suite | Passed | Failed | Skipped | Time |
---|---|---|---|---|
org.forgerock.android.auth.devicebind.DeviceBindAuthenticationTests | 20✅ | 991ms |
✅ forgerock-auth/build/test-results/testDebugUnitTest/TEST-org.forgerock.android.auth.devicebind.LocalDeviceBindingRepositoryTests.xml
2 tests were completed in 46ms with 2 passed, 0 failed and 0 skipped.
Test suite | Passed | Failed | Skipped | Time |
---|---|---|---|---|
org.forgerock.android.auth.devicebind.LocalDeviceBindingRepositoryTests | 2✅ | 46ms |
✅ forgerock-auth/build/test-results/testDebugUnitTest/TEST-org.forgerock.android.auth.devicebind.RSASASignatureSignerTests.xml
2 tests were completed in 201ms with 2 passed, 0 failed and 0 skipped.
Test suite | Passed | Failed | Skipped | Time |
---|---|---|---|---|
org.forgerock.android.auth.devicebind.RSASASignatureSignerTests | 2✅ | 201ms |
✅ forgerock-auth/build/test-results/testDebugUnitTest/TEST-org.forgerock.android.auth.devicebind.UserDeviceKeyServiceTest.xml
10 tests were completed in 243ms with 10 passed, 0 failed and 0 skipped.
Test suite | Passed | Failed | Skipped | Time |
---|---|---|---|---|
org.forgerock.android.auth.devicebind.UserDeviceKeyServiceTest | 10✅ | 243ms |
✅ forgerock-auth/build/test-results/testDebugUnitTest/TEST-org.forgerock.android.auth.DeviceBindingRepositoryTest.xml
2 tests were completed in 162ms with 2 passed, 0 failed and 0 skipped.
Test suite | Passed | Failed | Skipped | Time |
---|---|---|---|---|
org.forgerock.android.auth.DeviceBindingRepositoryTest | 2✅ | 162ms |
✅ forgerock-auth/build/test-results/testDebugUnitTest/TEST-org.forgerock.android.auth.ExtensionTest.xml
3 tests were completed in 2ms with 3 passed, 0 failed and 0 skipped.
Test suite | Passed | Failed | Skipped | Time |
---|---|---|---|---|
org.forgerock.android.auth.ExtensionTest | 3✅ | 2ms |
✅ forgerock-auth/build/test-results/testDebugUnitTest/TEST-org.forgerock.android.auth.FRAuthMockTest.xml
5 tests were completed in 313ms with 5 passed, 0 failed and 0 skipped.
Test suite | Passed | Failed | Skipped | Time |
---|---|---|---|---|
org.forgerock.android.auth.FRAuthMockTest | 5✅ | 313ms |
✅ forgerock-auth/build/test-results/testDebugUnitTest/TEST-org.forgerock.android.auth.FRAuthRegistrationMockTest.xml
5 tests were completed in 464ms with 5 passed, 0 failed and 0 skipped.
Test suite | Passed | Failed | Skipped | Time |
---|---|---|---|---|
org.forgerock.android.auth.FRAuthRegistrationMockTest | 5✅ | 464ms |
✅ forgerock-auth/build/test-results/testDebugUnitTest/TEST-org.forgerock.android.auth.FRDeviceTest.xml
7 tests were completed in 252ms with 7 passed, 0 failed and 0 skipped.
Test suite | Passed | Failed | Skipped | Time |
---|---|---|---|---|
org.forgerock.android.auth.FRDeviceTest | 7✅ | 252ms |
✅ forgerock-auth/build/test-results/testDebugUnitTest/TEST-org.forgerock.android.auth.FRLifeCycleListenerTest.xml
2 tests were completed in 5s with 2 passed, 0 failed and 0 skipped.
Test suite | Passed | Failed | Skipped | Time |
---|---|---|---|---|
org.forgerock.android.auth.FRLifeCycleListenerTest | 2✅ | 5s |
✅ forgerock-auth/build/test-results/testDebugUnitTest/TEST-org.forgerock.android.auth.FROptionTest.xml
5 tests were completed in 9ms with 5 passed, 0 failed and 0 skipped.
Test suite | Passed | Failed | Skipped | Time |
---|---|---|---|---|
org.forgerock.android.auth.FROptionTest | 5✅ | 9ms |
✅ forgerock-auth/build/test-results/testDebugUnitTest/TEST-org.forgerock.android.auth.FRSessionMockTest.xml
10 tests were completed in 21s with 10 passed, 0 failed and 0 skipped.
Test suite | Passed | Failed | Skipped | Time |
---|---|---|---|---|
org.forgerock.android.auth.FRSessionMockTest | 10✅ | 21s |
✅ forgerock-auth/build/test-results/testDebugUnitTest/TEST-org.forgerock.android.auth.FRUserMockTest.xml
29 tests were completed in 5s with 27 passed, 0 failed and 2 skipped.
Test suite | Passed | Failed | Skipped | Time |
---|---|---|---|---|
org.forgerock.android.auth.FRUserMockTest | 27✅ | 2⚪ | 5s |
✅ forgerock-auth/build/test-results/testDebugUnitTest/TEST-org.forgerock.android.auth.OAuth2MockTest.xml
5 tests were completed in 216ms with 5 passed, 0 failed and 0 skipped.
Test suite | Passed | Failed | Skipped | Time |
---|---|---|---|---|
org.forgerock.android.auth.OAuth2MockTest | 5✅ | 216ms |
✅ forgerock-auth/build/test-results/testDebugUnitTest/TEST-org.forgerock.android.auth.PersistentCookieTest.xml
8 tests were completed in 439ms with 8 passed, 0 failed and 0 skipped.
Test suite | Passed | Failed | Skipped | Time |
---|---|---|---|---|
org.forgerock.android.auth.PersistentCookieTest | 8✅ | 439ms |
✅ forgerock-auth/build/test-results/testDebugUnitTest/TEST-org.forgerock.android.auth.PolicyAdviceTest.xml
7 tests were completed in 610ms with 7 passed, 0 failed and 0 skipped.
Test suite | Passed | Failed | Skipped | Time |
---|---|---|---|---|
org.forgerock.android.auth.PolicyAdviceTest | 7✅ | 610ms |
✅ forgerock-auth/build/test-results/testDebugUnitTest/TEST-org.forgerock.android.auth.ServerConfigTest.xml
10 tests were completed in 720ms with 10 passed, 0 failed and 0 skipped.
Test suite | Passed | Failed | Skipped | Time |
---|---|---|---|---|
org.forgerock.android.auth.ServerConfigTest | 10✅ | 720ms |
✅ forgerock-auth/build/test-results/testDebugUnitTest/TEST-org.forgerock.android.auth.SocialLoginTest.xml
6 tests were completed in 2s with 6 passed, 0 failed and 0 skipped.
Test suite | Passed | Failed | Skipped | Time |
---|---|---|---|---|
org.forgerock.android.auth.SocialLoginTest | 6✅ | 2s |
✅ forgerock-auth/build/test-results/testDebugUnitTest/TEST-org.forgerock.android.auth.SSOBroadcastModelTest.xml
4 tests were completed in 1s with 4 passed, 0 failed and 0 skipped.
Test suite | Passed | Failed | Skipped | Time |
---|---|---|---|---|
org.forgerock.android.auth.SSOBroadcastModelTest | 4✅ | 1s |
✅ forgerock-auth/build/test-results/testDebugUnitTest/TEST-org.forgerock.android.auth.SSOBroadcastReceiverIntegrationTests.xml
1 tests were completed in 231ms with 1 passed, 0 failed and 0 skipped.
Test suite | Passed | Failed | Skipped | Time |
---|---|---|---|---|
org.forgerock.android.auth.SSOBroadcastReceiverIntegrationTests | 1✅ | 231ms |
✅ forgerock-auth/build/test-results/testDebugUnitTest/TEST-org.forgerock.android.auth.SSOBroadcastReceiverTest.xml
2 tests were completed in 118ms with 2 passed, 0 failed and 0 skipped.
Test suite | Passed | Failed | Skipped | Time |
---|---|---|---|---|
org.forgerock.android.auth.SSOBroadcastReceiverTest | 2✅ | 118ms |
✅ forgerock-auth/build/test-results/testDebugUnitTest/TEST-org.forgerock.android.auth.webauthn.FRWebAuthnTest.xml
3 tests were completed in 65ms with 3 passed, 0 failed and 0 skipped.
Test suite | Passed | Failed | Skipped | Time |
---|---|---|---|---|
org.forgerock.android.auth.webauthn.FRWebAuthnTest | 3✅ | 65ms |
✅ forgerock-auth/build/test-results/testDebugUnitTest/TEST-org.forgerock.android.auth.webauthn.WebAuthnAuthenticationTest.xml
3 tests were completed in 205ms with 3 passed, 0 failed and 0 skipped.
Test suite | Passed | Failed | Skipped | Time |
---|---|---|---|---|
org.forgerock.android.auth.webauthn.WebAuthnAuthenticationTest | 3✅ | 205ms |
✅ forgerock-auth/build/test-results/testDebugUnitTest/TEST-org.forgerock.android.auth.webauthn.WebAuthnRegistrationTest.xml
2 tests were completed in 126ms with 2 passed, 0 failed and 0 skipped.
Test suite | Passed | Failed | Skipped | Time |
---|---|---|---|---|
org.forgerock.android.auth.webauthn.WebAuthnRegistrationTest | 2✅ | 126ms |
✅ forgerock-auth/build/test-results/testDebugUnitTest/TEST-org.forgerock.android.auth.WebAuthnDataRepositoryTest.xml
7 tests were completed in 336ms with 7 passed, 0 failed and 0 skipped.
Test suite | Passed | Failed | Skipped | Time |
---|---|---|---|---|
org.forgerock.android.auth.WebAuthnDataRepositoryTest | 7✅ | 336ms |
✅ forgerock-authenticator/build/test-results/testDebugUnitTest/TEST-org.forgerock.android.auth.AccountTest.xml
14 tests were completed in 4s with 14 passed, 0 failed and 0 skipped.
Test suite | Passed | Failed | Skipped | Time |
---|---|---|---|---|
org.forgerock.android.auth.AccountTest | 14✅ | 4s |
✅ forgerock-authenticator/build/test-results/testDebugUnitTest/TEST-org.forgerock.android.auth.AuthenticatorManagerTest.xml
33 tests were completed in 3s with 33 passed, 0 failed and 0 skipped.
Test suite | Passed | Failed | Skipped | Time |
---|---|---|---|---|
org.forgerock.android.auth.AuthenticatorManagerTest | 33✅ | 3s |
✅ forgerock-authenticator/build/test-results/testDebugUnitTest/TEST-org.forgerock.android.auth.DefaultStorageClientTest.xml
20 tests were completed in 894ms with 20 passed, 0 failed and 0 skipped.
Test suite | Passed | Failed | Skipped | Time |
---|---|---|---|---|
org.forgerock.android.auth.DefaultStorageClientTest | 20✅ | 894ms |
✅ forgerock-authenticator/build/test-results/testDebugUnitTest/TEST-org.forgerock.android.auth.FRAClientTest.xml
32 tests were completed in 981ms with 32 passed, 0 failed and 0 skipped.
Test suite | Passed | Failed | Skipped | Time |
---|---|---|---|---|
org.forgerock.android.auth.FRAClientTest | 32✅ | 981ms |
✅ forgerock-authenticator/build/test-results/testDebugUnitTest/TEST-org.forgerock.android.auth.FRAPolicyEvaluatorTest.xml
11 tests were completed in 303ms with 11 passed, 0 failed and 0 skipped.
Test suite | Passed | Failed | Skipped | Time |
---|---|---|---|---|
org.forgerock.android.auth.FRAPolicyEvaluatorTest | 11✅ | 303ms |
✅ forgerock-authenticator/build/test-results/testDebugUnitTest/TEST-org.forgerock.android.auth.HOTPMechanismTest.xml
12 tests were completed in 302ms with 12 passed, 0 failed and 0 skipped.
Test suite | Passed | Failed | Skipped | Time |
---|---|---|---|---|
org.forgerock.android.auth.HOTPMechanismTest | 12✅ | 302ms |
✅ forgerock-authenticator/build/test-results/testDebugUnitTest/TEST-org.forgerock.android.auth.NotificationFactoryTest.xml
16 tests were completed in 382ms with 16 passed, 0 failed and 0 skipped.
Test suite | Passed | Failed | Skipped | Time |
---|---|---|---|---|
org.forgerock.android.auth.NotificationFactoryTest | 16✅ | 382ms |
❌ forgerock-authenticator/build/test-results/testDebugUnitTest/TEST-org.forgerock.android.auth.OathCodeGeneratorTest.xml
18 tests were completed in 643ms with 16 passed, 2 failed and 0 skipped.
Test suite | Passed | Failed | Skipped | Time |
---|---|---|---|---|
org.forgerock.android.auth.OathCodeGeneratorTest | 16✅ | 2❌ | 643ms |
❌ org.forgerock.android.auth.OathCodeGeneratorTest
✅ testShouldGenerateCodeHotpSHA224Algorithm
✅ testShouldGenerateCodeHotpMD5Algorithm
✅ testShouldGenerateCodeTotpSHA384Algorithm
✅ testShouldGenerateCodeTotpSHA512Algorithm
❌ testShouldFailToHandleHOTPInvalidSecret
java.lang.AssertionError
✅ testShouldGenerateCodeTotpSHA256Algorithm
✅ testHandleHOTPCorrectlyWith6Digits
✅ testShouldGenerateCodeTotpSHA1Algorithm
✅ testShouldFailToGetInstanceNotInitialized
✅ testShouldGenerateCodeHotpSHA384Algorithm
✅ testShouldGenerateCodeHotpSHA1Algorithm
✅ testShouldGenerateCodeHotpSHA512Algorithm
✅ testShouldGenerateCodeTotpSHA224Algorithm
✅ testShouldGenerateCodeHotpSHA256Algorithm
❌ testShouldFailToHandleHOTPInvalidAlgorithm
java.lang.AssertionError
✅ testShouldGenerateCodeTotpMD5Algorithm
✅ testHandleHOTPCorrectlyWith8Digits
✅ testHandleTOTPCorrectly
✅ forgerock-authenticator/build/test-results/testDebugUnitTest/TEST-org.forgerock.android.auth.OathFactoryTest.xml
35 tests were completed in 1s with 35 passed, 0 failed and 0 skipped.
Test suite | Passed | Failed | Skipped | Time |
---|---|---|---|---|
org.forgerock.android.auth.OathFactoryTest | 35✅ | 1s |
✅ forgerock-authenticator/build/test-results/testDebugUnitTest/TEST-org.forgerock.android.auth.OathMechanismTest.xml
2 tests were completed in 42ms with 2 passed, 0 failed and 0 skipped.
Test suite | Passed | Failed | Skipped | Time |
---|---|---|---|---|
org.forgerock.android.auth.OathMechanismTest | 2✅ | 42ms |
✅ forgerock-authenticator/build/test-results/testDebugUnitTest/TEST-org.forgerock.android.auth.OathParserTest.xml
17 tests were completed in 348ms with 17 passed, 0 failed and 0 skipped.
Test suite | Passed | Failed | Skipped | Time |
---|---|---|---|---|
org.forgerock.android.auth.OathParserTest | 17✅ | 348ms |
✅ forgerock-authenticator/build/test-results/testDebugUnitTest/TEST-org.forgerock.android.auth.OathTokenCodeTest.xml
6 tests were completed in 171ms with 6 passed, 0 failed and 0 skipped.
Test suite | Passed | Failed | Skipped | Time |
---|---|---|---|---|
org.forgerock.android.auth.OathTokenCodeTest | 6✅ | 171ms |
✅ forgerock-authenticator/build/test-results/testDebugUnitTest/TEST-org.forgerock.android.auth.PushFactoryTest.xml
13 tests were completed in 360ms with 13 passed, 0 failed and 0 skipped.
Test suite | Passed | Failed | Skipped | Time |
---|---|---|---|---|
org.forgerock.android.auth.PushFactoryTest | 13✅ | 360ms |
✅ forgerock-authenticator/build/test-results/testDebugUnitTest/TEST-org.forgerock.android.auth.PushMechanismTest.xml
11 tests were completed in 170ms with 11 passed, 0 failed and 0 skipped.
Test suite | Passed | Failed | Skipped | Time |
---|---|---|---|---|
org.forgerock.android.auth.PushMechanismTest | 11✅ | 170ms |
✅ forgerock-authenticator/build/test-results/testDebugUnitTest/TEST-org.forgerock.android.auth.PushNotificationTest.xml
21 tests were completed in 390ms with 21 passed, 0 failed and 0 skipped.
Test suite | Passed | Failed | Skipped | Time |
---|---|---|---|---|
org.forgerock.android.auth.PushNotificationTest | 21✅ | 390ms |
✅ forgerock-authenticator/build/test-results/testDebugUnitTest/TEST-org.forgerock.android.auth.PushParserTest.xml
12 tests were completed in 169ms with 12 passed, 0 failed and 0 skipped.
Test suite | Passed | Failed | Skipped | Time |
---|---|---|---|---|
org.forgerock.android.auth.PushParserTest | 12✅ | 169ms |
✅ forgerock-authenticator/build/test-results/testDebugUnitTest/TEST-org.forgerock.android.auth.PushRequestInterceptorTest.xml
2 tests were completed in 109ms with 2 passed, 0 failed and 0 skipped.
Test suite | Passed | Failed | Skipped | Time |
---|---|---|---|---|
org.forgerock.android.auth.PushRequestInterceptorTest | 2✅ | 109ms |
✅ forgerock-authenticator/build/test-results/testDebugUnitTest/TEST-org.forgerock.android.auth.PushResponderTest.xml
12 tests were completed in 395ms with 12 passed, 0 failed and 0 skipped.
Test suite | Passed | Failed | Skipped | Time |
---|---|---|---|---|
org.forgerock.android.auth.PushResponderTest | 12✅ | 395ms |
✅ forgerock-authenticator/build/test-results/testDebugUnitTest/TEST-org.forgerock.android.auth.TOTPMechanismTest.xml
11 tests were completed in 249ms with 11 passed, 0 failed and 0 skipped.
Test suite | Passed | Failed | Skipped | Time |
---|---|---|---|---|
org.forgerock.android.auth.TOTPMechanismTest | 11✅ | 249ms |
✅ forgerock-core/build/test-results/testDebugUnitTest/TEST-org.forgerock.android.auth.AppPinAuthenticatorTest.xml
6 tests were completed in 16s with 6 passed, 0 failed and 0 skipped.
Test suite | Passed | Failed | Skipped | Time |
---|---|---|---|---|
org.forgerock.android.auth.AppPinAuthenticatorTest | 6✅ | 16s |
✅ forgerock-core/build/test-results/testDebugUnitTest/TEST-org.forgerock.android.auth.InterceptorProviderTest.xml
6 tests were completed in 458ms with 6 passed, 0 failed and 0 skipped.
Test suite | Passed | Failed | Skipped | Time |
---|---|---|---|---|
org.forgerock.android.auth.InterceptorProviderTest | 6✅ | 458ms |
✅ forgerock-core/build/test-results/testDebugUnitTest/TEST-org.forgerock.android.auth.KeyStoreManagerTest.xml
2 tests were completed in 403ms with 2 passed, 0 failed and 0 skipped.
Test suite | Passed | Failed | Skipped | Time |
---|---|---|---|---|
org.forgerock.android.auth.KeyStoreManagerTest | 2✅ | 403ms |
✅ forgerock-core/build/test-results/testDebugUnitTest/TEST-org.forgerock.android.auth.LoggerTest.xml
12 tests were completed in 332ms with 12 passed, 0 failed and 0 skipped.
Test suite | Passed | Failed | Skipped | Time |
---|---|---|---|---|
org.forgerock.android.auth.LoggerTest | 12✅ | 332ms |
✅ forgerock-core/build/test-results/testDebugUnitTest/TEST-org.forgerock.android.auth.LoggerUnitTest.xml
3 tests were completed in 21ms with 3 passed, 0 failed and 0 skipped.
Test suite | Passed | Failed | Skipped | Time |
---|---|---|---|---|
org.forgerock.android.auth.LoggerUnitTest | 3✅ | 21ms |
✅ forgerock-core/build/test-results/testDebugUnitTest/TEST-org.forgerock.android.auth.NetworkConfigTest.xml
3 tests were completed in 323ms with 3 passed, 0 failed and 0 skipped.
Test suite | Passed | Failed | Skipped | Time |
---|---|---|---|---|
org.forgerock.android.auth.NetworkConfigTest | 3✅ | 323ms |
✅ forgerock-core/build/test-results/testDebugUnitTest/TEST-org.forgerock.android.auth.RequestInterceptorTest.xml
18 tests were completed in 1s with 18 passed, 0 failed and 0 skipped.
Test suite | Passed | Failed | Skipped | Time |
---|---|---|---|---|
org.forgerock.android.auth.RequestInterceptorTest | 18✅ | 1s |
✅ forgerock-core/build/test-results/testDebugUnitTest/TEST-org.forgerock.android.auth.RootDetectorTest.xml
12 tests were completed in 312ms with 12 passed, 0 failed and 0 skipped.
Test suite | Passed | Failed | Skipped | Time |
---|---|---|---|---|
org.forgerock.android.auth.RootDetectorTest | 12✅ | 312ms |
Annotations
github-actions / Unit tests results
org.forgerock.android.auth.OathCodeGeneratorTest ► testShouldFailToHandleHOTPInvalidSecret
Failed test found in:
forgerock-authenticator/build/test-results/testDebugUnitTest/TEST-org.forgerock.android.auth.OathCodeGeneratorTest.xml
Error:
java.lang.AssertionError
Raw output
java.lang.AssertionError
at org.junit.Assert.fail(Assert.java:87)
at org.junit.Assert.assertTrue(Assert.java:42)
at org.junit.Assert.assertTrue(Assert.java:53)
at org.forgerock.android.auth.OathCodeGeneratorTest.testShouldFailToHandleHOTPInvalidSecret(OathCodeGeneratorTest.java:484)
at java.base/jdk.internal.reflect.NativeMethodAccessorImpl.invoke0(Native Method)
at java.base/jdk.internal.reflect.NativeMethodAccessorImpl.invoke(NativeMethodAccessorImpl.java:77)
at java.base/jdk.internal.reflect.DelegatingMethodAccessorImpl.invoke(DelegatingMethodAccessorImpl.java:43)
at java.base/java.lang.reflect.Method.invoke(Method.java:568)
at org.junit.runners.model.FrameworkMethod$1.runReflectiveCall(FrameworkMethod.java:59)
at org.junit.internal.runners.model.ReflectiveCallable.run(ReflectiveCallable.java:12)
at org.junit.runners.model.FrameworkMethod.invokeExplosively(FrameworkMethod.java:56)
at org.junit.internal.runners.statements.InvokeMethod.evaluate(InvokeMethod.java:17)
at org.junit.internal.runners.statements.RunBefores.evaluate(RunBefores.java:26)
at org.junit.internal.runners.statements.RunAfters.evaluate(RunAfters.java:27)
at org.junit.runners.ParentRunner$3.evaluate(ParentRunner.java:306)
at org.junit.runners.BlockJUnit4ClassRunner$1.evaluate(BlockJUnit4ClassRunner.java:100)
at org.junit.runners.ParentRunner.runLeaf(ParentRunner.java:366)
at org.junit.runners.BlockJUnit4ClassRunner.runChild(BlockJUnit4ClassRunner.java:103)
at org.junit.runners.BlockJUnit4ClassRunner.runChild(BlockJUnit4ClassRunner.java:63)
at org.junit.runners.ParentRunner$4.run(ParentRunner.java:331)
at org.junit.runners.ParentRunner$1.schedule(ParentRunner.java:79)
at org.junit.runners.ParentRunner.runChildren(ParentRunner.java:329)
at org.junit.runners.ParentRunner.access$100(ParentRunner.java:66)
at org.junit.runners.ParentRunner$2.evaluate(ParentRunner.java:293)
at org.junit.internal.runners.statements.RunBefores.evaluate(RunBefores.java:26)
at org.junit.runners.ParentRunner$3.evaluate(ParentRunner.java:306)
at org.junit.runners.ParentRunner.run(ParentRunner.java:413)
at org.gradle.api.internal.tasks.testing.junit.JUnitTestClassExecutor.runTestClass(JUnitTestClassExecutor.java:108)
at org.gradle.api.internal.tasks.testing.junit.JUnitTestClassExecutor.execute(JUnitTestClassExecutor.java:58)
at org.gradle.api.internal.tasks.testing.junit.JUnitTestClassExecutor.execute(JUnitTestClassExecutor.java:40)
at org.gradle.api.internal.tasks.testing.junit.AbstractJUnitTestClassProcessor.processTestClass(AbstractJUnitTestClassProcessor.java:60)
at org.gradle.api.internal.tasks.testing.SuiteTestClassProcessor.processTestClass(SuiteTestClassProcessor.java:52)
at java.base/jdk.internal.reflect.NativeMethodAccessorImpl.invoke0(Native Method)
at java.base/jdk.internal.reflect.NativeMethodAccessorImpl.invoke(NativeMethodAccessorImpl.java:77)
at java.base/jdk.internal.reflect.DelegatingMethodAccessorImpl.invoke(DelegatingMethodAccessorImpl.java:43)
at java.base/java.lang.reflect.Method.invoke(Method.java:568)
at org.gradle.internal.dispatch.ReflectionDispatch.dispatch(ReflectionDispatch.java:36)
at org.gradle.internal.dispatch.ReflectionDispatch.dispatch(ReflectionDispatch.java:24)
at org.gradle.internal.dispatch.ContextClassLoaderDispatch.dispatch(ContextClassLoaderDispatch.java:33)
at org.gradle.internal.dispatch.ProxyDispatchAdapter$DispatchingInvocationHandler.invoke(ProxyDispatchAdapter.java:94)
at jdk.proxy1/jdk.proxy1.$Proxy2.processTestClass(Unknown Source)
at org.gradle.api.internal.tasks.testing.worker.TestWorker$2.run(TestWorker.java:176)
at org.gradle.api.internal.tasks.testing.worker.TestWorker.executeAndMaintainThreadName(TestWorker.java:129)
at org.gradle.api.internal.tasks.testing.worker.TestWorker.execute(TestWorker.java:100)
at org.gradle.api.internal.tasks.testing.worker.TestWorker.execute(TestWorker.java:60)
at org.gradle.process.internal.worker.child.ActionExecutionWorker.execute(ActionExecutionWorker.java:56)
at org.gradle.process.internal.worker.child.SystemApplicationClassLoaderWorker.call(SystemApplicationClassLoaderWorker.java:113)
at org.gradle.process.internal.worker.child.SystemApplicationClassLoaderWorker.call(SystemApplicationClassLoaderWorker.java:65)
at worker.org.gradle.process.internal.worker.GradleWorkerMain.run(GradleWorkerMain.java:69)
at worker.org.gradle.process.internal.worker.GradleWorkerMain.main(GradleWorkerMain.java:74)
github-actions / Unit tests results
org.forgerock.android.auth.OathCodeGeneratorTest ► testShouldFailToHandleHOTPInvalidAlgorithm
Failed test found in:
forgerock-authenticator/build/test-results/testDebugUnitTest/TEST-org.forgerock.android.auth.OathCodeGeneratorTest.xml
Error:
java.lang.AssertionError
Raw output
java.lang.AssertionError
at org.junit.Assert.fail(Assert.java:87)
at org.junit.Assert.assertTrue(Assert.java:42)
at org.junit.Assert.assertTrue(Assert.java:53)
at org.forgerock.android.auth.OathCodeGeneratorTest.testShouldFailToHandleHOTPInvalidAlgorithm(OathCodeGeneratorTest.java:462)
at java.base/jdk.internal.reflect.NativeMethodAccessorImpl.invoke0(Native Method)
at java.base/jdk.internal.reflect.NativeMethodAccessorImpl.invoke(NativeMethodAccessorImpl.java:77)
at java.base/jdk.internal.reflect.DelegatingMethodAccessorImpl.invoke(DelegatingMethodAccessorImpl.java:43)
at java.base/java.lang.reflect.Method.invoke(Method.java:568)
at org.junit.runners.model.FrameworkMethod$1.runReflectiveCall(FrameworkMethod.java:59)
at org.junit.internal.runners.model.ReflectiveCallable.run(ReflectiveCallable.java:12)
at org.junit.runners.model.FrameworkMethod.invokeExplosively(FrameworkMethod.java:56)
at org.junit.internal.runners.statements.InvokeMethod.evaluate(InvokeMethod.java:17)
at org.junit.internal.runners.statements.RunBefores.evaluate(RunBefores.java:26)
at org.junit.internal.runners.statements.RunAfters.evaluate(RunAfters.java:27)
at org.junit.runners.ParentRunner$3.evaluate(ParentRunner.java:306)
at org.junit.runners.BlockJUnit4ClassRunner$1.evaluate(BlockJUnit4ClassRunner.java:100)
at org.junit.runners.ParentRunner.runLeaf(ParentRunner.java:366)
at org.junit.runners.BlockJUnit4ClassRunner.runChild(BlockJUnit4ClassRunner.java:103)
at org.junit.runners.BlockJUnit4ClassRunner.runChild(BlockJUnit4ClassRunner.java:63)
at org.junit.runners.ParentRunner$4.run(ParentRunner.java:331)
at org.junit.runners.ParentRunner$1.schedule(ParentRunner.java:79)
at org.junit.runners.ParentRunner.runChildren(ParentRunner.java:329)
at org.junit.runners.ParentRunner.access$100(ParentRunner.java:66)
at org.junit.runners.ParentRunner$2.evaluate(ParentRunner.java:293)
at org.junit.internal.runners.statements.RunBefores.evaluate(RunBefores.java:26)
at org.junit.runners.ParentRunner$3.evaluate(ParentRunner.java:306)
at org.junit.runners.ParentRunner.run(ParentRunner.java:413)
at org.gradle.api.internal.tasks.testing.junit.JUnitTestClassExecutor.runTestClass(JUnitTestClassExecutor.java:108)
at org.gradle.api.internal.tasks.testing.junit.JUnitTestClassExecutor.execute(JUnitTestClassExecutor.java:58)
at org.gradle.api.internal.tasks.testing.junit.JUnitTestClassExecutor.execute(JUnitTestClassExecutor.java:40)
at org.gradle.api.internal.tasks.testing.junit.AbstractJUnitTestClassProcessor.processTestClass(AbstractJUnitTestClassProcessor.java:60)
at org.gradle.api.internal.tasks.testing.SuiteTestClassProcessor.processTestClass(SuiteTestClassProcessor.java:52)
at java.base/jdk.internal.reflect.NativeMethodAccessorImpl.invoke0(Native Method)
at java.base/jdk.internal.reflect.NativeMethodAccessorImpl.invoke(NativeMethodAccessorImpl.java:77)
at java.base/jdk.internal.reflect.DelegatingMethodAccessorImpl.invoke(DelegatingMethodAccessorImpl.java:43)
at java.base/java.lang.reflect.Method.invoke(Method.java:568)
at org.gradle.internal.dispatch.ReflectionDispatch.dispatch(ReflectionDispatch.java:36)
at org.gradle.internal.dispatch.ReflectionDispatch.dispatch(ReflectionDispatch.java:24)
at org.gradle.internal.dispatch.ContextClassLoaderDispatch.dispatch(ContextClassLoaderDispatch.java:33)
at org.gradle.internal.dispatch.ProxyDispatchAdapter$DispatchingInvocationHandler.invoke(ProxyDispatchAdapter.java:94)
at jdk.proxy1/jdk.proxy1.$Proxy2.processTestClass(Unknown Source)
at org.gradle.api.internal.tasks.testing.worker.TestWorker$2.run(TestWorker.java:176)
at org.gradle.api.internal.tasks.testing.worker.TestWorker.executeAndMaintainThreadName(TestWorker.java:129)
at org.gradle.api.internal.tasks.testing.worker.TestWorker.execute(TestWorker.java:100)
at org.gradle.api.internal.tasks.testing.worker.TestWorker.execute(TestWorker.java:60)
at org.gradle.process.internal.worker.child.ActionExecutionWorker.execute(ActionExecutionWorker.java:56)
at org.gradle.process.internal.worker.child.SystemApplicationClassLoaderWorker.call(SystemApplicationClassLoaderWorker.java:113)
at org.gradle.process.internal.worker.child.SystemApplicationClassLoaderWorker.call(SystemApplicationClassLoaderWorker.java:65)
at worker.org.gradle.process.internal.worker.GradleWorkerMain.run(GradleWorkerMain.java:69)
at worker.org.gradle.process.internal.worker.GradleWorkerMain.main(GradleWorkerMain.java:74)