-
Notifications
You must be signed in to change notification settings - Fork 0
/
Copy path2023-06-06-21_12_58.log
225 lines (217 loc) · 14.1 KB
/
2023-06-06-21_12_58.log
1
2
3
4
5
6
7
8
9
10
11
12
13
14
15
16
17
18
19
20
21
22
23
24
25
26
27
28
29
30
31
32
33
34
35
36
37
38
39
40
41
42
43
44
45
46
47
48
49
50
51
52
53
54
55
56
57
58
59
60
61
62
63
64
65
66
67
68
69
70
71
72
73
74
75
76
77
78
79
80
81
82
83
84
85
86
87
88
89
90
91
92
93
94
95
96
97
98
99
100
101
102
103
104
105
106
107
108
109
110
111
112
113
114
115
116
117
118
119
120
121
122
123
124
125
126
127
128
129
130
131
132
133
134
135
136
137
138
139
140
141
142
143
144
145
146
147
148
149
150
151
152
153
154
155
156
157
158
159
160
161
162
163
164
165
166
167
168
169
170
171
172
173
174
175
176
177
178
179
180
181
182
183
184
185
186
187
188
189
190
191
192
193
194
195
196
197
198
199
200
201
202
203
204
205
206
207
208
209
210
211
212
213
214
215
216
217
218
219
220
221
222
223
224
225
+ source ../common/common_lib.sh
++ source /root/mugen/libs/locallibs/common_lib.sh
+++ python3 --version
+++ '[' 0 -eq 0 ']'
+++ source /root/mugen/libs/locallibs/common_lib_python.sh
+ main
++ type -t post_test
+ '[' -n function ']'
+ trap post_test EXIT INT HUP TERM
+ rpm -qa
+ grep expect
++ type -t config_params
+ '[' -n '' ']'
++ type -t pre_test
+ '[' -n function ']'
+ pre_test
+ LOG_INFO 'Start environmental preparation.'
+ message='Start environmental preparation.'
+ python3 /root/mugen/libs/locallibs/mugen_log.py --level info --message 'Start environmental preparation.'
Tue Jun 6 21:13:00 2023 - INFO - Start environmental preparation.
+ DNF_INSTALL 'keyutils gcc make'
+ pkgs='keyutils gcc make'
+ node=1
+ '[' -z '' ']'
+ tmpfile=
++ python3 /root/mugen/libs/locallibs/rpm_manage.py install --pkgs 'keyutils gcc make' --node 1 --tempfile ''
+ tmpfile2='Last metadata expiration check: 0:00:12 ago on Tue 06 Jun 2023 09:13:06 PM UTC.
Package make-1:4.4-2.oe2303.x86_64 is already installed.
Dependencies resolved.
================================================================================
Package Architecture Version Repo Size
================================================================================
Installing:
gcc x86_64 10.3.1-26.oe2303 OS 29 M
keyutils x86_64 1.6.3-5.oe2303 OS 53 k
Installing dependencies:
binutils x86_64 2.37-14.oe2303 OS 5.4 M
cpp x86_64 10.3.1-26.oe2303 OS 9.0 M
glibc-devel x86_64 2.36-13.oe2303 OS 2.0 M
kernel-headers x86_64 6.1.19-7.0.0.17.oe2303 OS 1.5 M
libmpc x86_64 1.3.1-1.oe2303 OS 65 k
libxcrypt-devel x86_64 4.4.33-1.oe2303 OS 105 k
Transaction Summary
================================================================================
Install 8 Packages
Total download size: 47 M
Installed size: 150 M
Downloading Packages:
Waiting for process with pid 3113 to finish.
[SKIPPED] binutils-2.37-14.oe2303.x86_64.rpm: Already downloaded
[SKIPPED] cpp-10.3.1-26.oe2303.x86_64.rpm: Already downloaded
[SKIPPED] gcc-10.3.1-26.oe2303.x86_64.rpm: Already downloaded
[SKIPPED] glibc-devel-2.36-13.oe2303.x86_64.rpm: Already downloaded
[SKIPPED] kernel-headers-6.1.19-7.0.0.17.oe2303.x86_64.rpm: Already downloaded
[SKIPPED] keyutils-1.6.3-5.oe2303.x86_64.rpm: Already downloaded
[SKIPPED] libmpc-1.3.1-1.oe2303.x86_64.rpm: Already downloaded
[SKIPPED] libxcrypt-devel-4.4.33-1.oe2303.x86_64.rpm: Already downloaded
Running transaction check
Waiting for process with pid 3113 to finish.
[Errno 2] No such file or directory: '\''/var/cache/dnf/OS-9d77b3507add28da/packages/binutils-2.37-14.oe2303.x86_64.rpm'\''
The downloaded packages were saved in cache until the next successful transaction.
You can remove cached packages by executing '\''dnf clean packages'\''.'
+ '[' -z '' ']'
+ tmpfile='Last metadata expiration check: 0:00:12 ago on Tue 06 Jun 2023 09:13:06 PM UTC.
Package make-1:4.4-2.oe2303.x86_64 is already installed.
Dependencies resolved.
================================================================================
Package Architecture Version Repo Size
================================================================================
Installing:
gcc x86_64 10.3.1-26.oe2303 OS 29 M
keyutils x86_64 1.6.3-5.oe2303 OS 53 k
Installing dependencies:
binutils x86_64 2.37-14.oe2303 OS 5.4 M
cpp x86_64 10.3.1-26.oe2303 OS 9.0 M
glibc-devel x86_64 2.36-13.oe2303 OS 2.0 M
kernel-headers x86_64 6.1.19-7.0.0.17.oe2303 OS 1.5 M
libmpc x86_64 1.3.1-1.oe2303 OS 65 k
libxcrypt-devel x86_64 4.4.33-1.oe2303 OS 105 k
Transaction Summary
================================================================================
Install 8 Packages
Total download size: 47 M
Installed size: 150 M
Downloading Packages:
Waiting for process with pid 3113 to finish.
[SKIPPED] binutils-2.37-14.oe2303.x86_64.rpm: Already downloaded
[SKIPPED] cpp-10.3.1-26.oe2303.x86_64.rpm: Already downloaded
[SKIPPED] gcc-10.3.1-26.oe2303.x86_64.rpm: Already downloaded
[SKIPPED] glibc-devel-2.36-13.oe2303.x86_64.rpm: Already downloaded
[SKIPPED] kernel-headers-6.1.19-7.0.0.17.oe2303.x86_64.rpm: Already downloaded
[SKIPPED] keyutils-1.6.3-5.oe2303.x86_64.rpm: Already downloaded
[SKIPPED] libmpc-1.3.1-1.oe2303.x86_64.rpm: Already downloaded
[SKIPPED] libxcrypt-devel-4.4.33-1.oe2303.x86_64.rpm: Already downloaded
Running transaction check
Waiting for process with pid 3113 to finish.
[Errno 2] No such file or directory: '\''/var/cache/dnf/OS-9d77b3507add28da/packages/binutils-2.37-14.oe2303.x86_64.rpm'\''
The downloaded packages were saved in cache until the next successful transaction.
You can remove cached packages by executing '\''dnf clean packages'\''.'
+ cp -arf /etc/request-key.conf /etc/request-key.conf.bak
+ LOG_INFO 'End of environmental preparation!'
+ message='End of environmental preparation!'
+ python3 /root/mugen/libs/locallibs/mugen_log.py --level info --message 'End of environmental preparation!'
Tue Jun 6 21:13:58 2023 - INFO - End of environmental preparation!
++ type -t run_test
+ '[' -n function ']'
+ run_test
+ LOG_INFO 'Start testing...'
+ message='Start testing...'
+ python3 /root/mugen/libs/locallibs/mugen_log.py --level info --message 'Start testing...'
Tue Jun 6 21:13:58 2023 - INFO - Start testing...
+ pushd ./common
~/mugen/testcases/cli-test/keyutils/common ~/mugen/testcases/cli-test/keyutils
+ make
gcc -lkeyutils t_request_key.c -o test_key
t_request_key.c:4:10: fatal error: keyutils.h: No such file or directory
4 | #include <keyutils.h>
| ^~~~~~~~~~~~
compilation terminated.
make: *** [Makefile:4: all] Error 1
+ test -f test_key
+ exit 1
+ post_test
+ LOG_INFO 'start environment cleanup.'
+ message='start environment cleanup.'
+ python3 /root/mugen/libs/locallibs/mugen_log.py --level info --message 'start environment cleanup.'
Tue Jun 6 21:13:59 2023 - INFO - start environment cleanup.
+ mv -f /etc/request-key.conf.bak /etc/request-key.conf
+ DNF_REMOVE
+ node=1
+ pkg_list=
+ mode=0
+ [[ -z Last metadata expiration check: 0:00:12 ago on Tue 06 Jun 2023 09:13:06 PM UTC.
Package make-1:4.4-2.oe2303.x86_64 is already installed.
Dependencies resolved.
================================================================================
Package Architecture Version Repo Size
================================================================================
Installing:
gcc x86_64 10.3.1-26.oe2303 OS 29 M
keyutils x86_64 1.6.3-5.oe2303 OS 53 k
Installing dependencies:
binutils x86_64 2.37-14.oe2303 OS 5.4 M
cpp x86_64 10.3.1-26.oe2303 OS 9.0 M
glibc-devel x86_64 2.36-13.oe2303 OS 2.0 M
kernel-headers x86_64 6.1.19-7.0.0.17.oe2303 OS 1.5 M
libmpc x86_64 1.3.1-1.oe2303 OS 65 k
libxcrypt-devel x86_64 4.4.33-1.oe2303 OS 105 k
Transaction Summary
================================================================================
Install 8 Packages
Total download size: 47 M
Installed size: 150 M
Downloading Packages:
Waiting for process with pid 3113 to finish.
[SKIPPED] binutils-2.37-14.oe2303.x86_64.rpm: Already downloaded
[SKIPPED] cpp-10.3.1-26.oe2303.x86_64.rpm: Already downloaded
[SKIPPED] gcc-10.3.1-26.oe2303.x86_64.rpm: Already downloaded
[SKIPPED] glibc-devel-2.36-13.oe2303.x86_64.rpm: Already downloaded
[SKIPPED] kernel-headers-6.1.19-7.0.0.17.oe2303.x86_64.rpm: Already downloaded
[SKIPPED] keyutils-1.6.3-5.oe2303.x86_64.rpm: Already downloaded
[SKIPPED] libmpc-1.3.1-1.oe2303.x86_64.rpm: Already downloaded
[SKIPPED] libxcrypt-devel-4.4.33-1.oe2303.x86_64.rpm: Already downloaded
Running transaction check
Waiting for process with pid 3113 to finish.
[Errno 2] No such file or directory: '/var/cache/dnf/OS-9d77b3507add28da/packages/binutils-2.37-14.oe2303.x86_64.rpm'
The downloaded packages were saved in cache until the next successful transaction.
You can remove cached packages by executing 'dnf clean packages'. ]]
+ '[' 0 -ne 0 ']'
+ '[' 1 == 0 ']'
+ python3 /root/mugen/libs/locallibs/rpm_manage.py remove --node 1 --pkgs '' --tempfile 'Last metadata expiration check: 0:00:12 ago on Tue 06 Jun 2023 09:13:06 PM UTC.
Package make-1:4.4-2.oe2303.x86_64 is already installed.
Dependencies resolved.
================================================================================
Package Architecture Version Repo Size
================================================================================
Installing:
gcc x86_64 10.3.1-26.oe2303 OS 29 M
keyutils x86_64 1.6.3-5.oe2303 OS 53 k
Installing dependencies:
binutils x86_64 2.37-14.oe2303 OS 5.4 M
cpp x86_64 10.3.1-26.oe2303 OS 9.0 M
glibc-devel x86_64 2.36-13.oe2303 OS 2.0 M
kernel-headers x86_64 6.1.19-7.0.0.17.oe2303 OS 1.5 M
libmpc x86_64 1.3.1-1.oe2303 OS 65 k
libxcrypt-devel x86_64 4.4.33-1.oe2303 OS 105 k
Transaction Summary
================================================================================
Install 8 Packages
Total download size: 47 M
Installed size: 150 M
Downloading Packages:
Waiting for process with pid 3113 to finish.
[SKIPPED] binutils-2.37-14.oe2303.x86_64.rpm: Already downloaded
[SKIPPED] cpp-10.3.1-26.oe2303.x86_64.rpm: Already downloaded
[SKIPPED] gcc-10.3.1-26.oe2303.x86_64.rpm: Already downloaded
[SKIPPED] glibc-devel-2.36-13.oe2303.x86_64.rpm: Already downloaded
[SKIPPED] kernel-headers-6.1.19-7.0.0.17.oe2303.x86_64.rpm: Already downloaded
[SKIPPED] keyutils-1.6.3-5.oe2303.x86_64.rpm: Already downloaded
[SKIPPED] libmpc-1.3.1-1.oe2303.x86_64.rpm: Already downloaded
[SKIPPED] libxcrypt-devel-4.4.33-1.oe2303.x86_64.rpm: Already downloaded
Running transaction check
Waiting for process with pid 3113 to finish.
[Errno 2] No such file or directory: '\''/var/cache/dnf/OS-9d77b3507add28da/packages/binutils-2.37-14.oe2303.x86_64.rpm'\''
The downloaded packages were saved in cache until the next successful transaction.
You can remove cached packages by executing '\''dnf clean packages'\''.'
Traceback (most recent call last):
File "/root/mugen/libs/locallibs/rpm_manage.py", line 173, in <module>
exitcode = rpm_remove(args.node, args.pkgs, args.tempfile)
File "/root/mugen/libs/locallibs/rpm_manage.py", line 144, in rpm_remove
with open(tmpfile, "r") as f:
OSError: [Errno 36] File name too long: "Last metadata expiration check: 0:00:12 ago on Tue 06 Jun 2023 09:13:06 PM UTC.\nPackage make-1:4.4-2.oe2303.x86_64 is already installed.\nDependencies resolved.\n================================================================================\n Package Architecture Version Repo Size\n================================================================================\nInstalling:\n gcc x86_64 10.3.1-26.oe2303 OS 29 M\n keyutils x86_64 1.6.3-5.oe2303 OS 53 k\nInstalling dependencies:\n binutils x86_64 2.37-14.oe2303 OS 5.4 M\n cpp x86_64 10.3.1-26.oe2303 OS 9.0 M\n glibc-devel x86_64 2.36-13.oe2303 OS 2.0 M\n kernel-headers x86_64 6.1.19-7.0.0.17.oe2303 OS 1.5 M\n libmpc x86_64 1.3.1-1.oe2303 OS 65 k\n libxcrypt-devel x86_64 4.4.33-1.oe2303 OS 105 k\n\nTransaction Summary\n================================================================================\nInstall 8 Packages\n\nTotal download size: 47 M\nInstalled size: 150 M\nDownloading Packages:\nWaiting for process with pid 3113 to finish.\n[SKIPPED] binutils-2.37-14.oe2303.x86_64.rpm: Already downloaded \n[SKIPPED] cpp-10.3.1-26.oe2303.x86_64.rpm: Already downloaded \n[SKIPPED] gcc-10.3.1-26.oe2303.x86_64.rpm: Already downloaded \n[SKIPPED] glibc-devel-2.36-13.oe2303.x86_64.rpm: Already downloaded \n[SKIPPED] kernel-headers-6.1.19-7.0.0.17.oe2303.x86_64.rpm: Already downloaded \n[SKIPPED] keyutils-1.6.3-5.oe2303.x86_64.rpm: Already downloaded \n[SKIPPED] libmpc-1.3.1-1.oe2303.x86_64.rpm: Already downloaded \n[SKIPPED] libxcrypt-devel-4.4.33-1.oe2303.x86_64.rpm: Already downloaded \nRunning transaction check\nWaiting for process with pid 3113 to finish.\n[Errno 2] No such file or directory: '/var/cache/dnf/OS-9d77b3507add28da/packages/binutils-2.37-14.oe2303.x86_64.rpm'\nThe downloaded packages were saved in cache until the next successful transaction.\nYou can remove cached packages by executing 'dnf clean packages'."
+ '[' 0 -ne 0 ']'
+ LOG_INFO 'Finish environment cleanup!'
+ message='Finish environment cleanup!'
+ python3 /root/mugen/libs/locallibs/mugen_log.py --level info --message 'Finish environment cleanup!'
Tue Jun 6 21:14:00 2023 - INFO - Finish environment cleanup!